{"text_format":"1","workbook":"xlsx","n_sheets":21,"sheets":["Form","Form1","Sheet3","Print2","Print (3)","Print","Sheet2","Sheet1","1","2","3","4","5","6","7","8","9","10","11","12","คู่มือ"],"not_rendered":{"charts":0,"images":9,"macros":1,"external_links":0,"defined_names":40,"comments":3,"pivot_tables":0},"unopened":[],"bounds":{"document_bytes":16777216,"sheet_cells":100000,"rows_first":2000,"rows_last":500,"rows_between":2000,"halvings":0,"cell_chars":16384,"cell_head_chars":4096},"cells_cut":0,"cells_raw":0,"read":"whole","date_system":"1900"}

{"sheet":"Form","index":0,"n_rows":20,"n_cols":11,"rows_kept":20,"cut":false,"hidden":false,"merged":[[4,4,4,7],[4,8,4,9],[21,8,21,9],[19,8,19,9]]}
[null,null,null,null,null,null,null,null,null,null,{"$f":"Print!F6","v":"69002"}]
[null,null,null,null,null,null,null,null,null,null,{"$f":"Print!F5","v":"puttachart@yahoo.com"}]
[null,null,null,null,null,null,null,null,null,null,{"$f":"Print!C5","v":1}]
[null,null,null,null,null,null,null,null,null,null,{"$f":"No","v":2}]
[null,null,null,null,null,null,null,null,null,null,{"$f":"Print!F7","v":"นางสาวสมหญิง บุญรักษา"}]
[]
{"$rows_left_out":15}
{"sheet":"Form1","index":1,"n_rows":0,"n_cols":0,"rows_kept":0,"cut":false,"hidden":true,"merged":[[4,4,4,7]]}

{"sheet":"Sheet3","index":2,"n_rows":0,"n_cols":0,"rows_kept":0,"cut":false,"hidden":true,"merged":[]}

{"sheet":"Print2","index":3,"n_rows":11,"n_cols":6,"rows_kept":11,"cut":false,"hidden":true,"merged":[]}
["2"]
["งวดที่",null,{"$f":"VLOOKUP(C4,TblMonthPeriod,2,0)&\"  \"&  VLOOKUP(C4,TblMonthPeriod,3,0)   &\"  \"&Print2!C5","v":"16-31  มกราคม  2567"},null,null,"( แบบจ่าย 2 งวด / เดือน)"]
[]
["ประจำงวดเดือน",null,{"$f":"A1+0","v":2},null,"วันที่จ่าย","15-05-2567"]
["ปี(เปลี่ยนเป็นปีปัจุบัน)",null,"2567"]
["จำนวนพนักงานทั้งหมด",null,{"$f":"VLOOKUP(C4,TblMonthData,3,0)","v":0},null,"แสดงตัวอย่างลำดับที่",1]
{"$rows_left_out":6}
{"sheet":"Print (3)","index":4,"n_rows":10,"n_cols":6,"rows_kept":10,"cut":false,"hidden":true,"merged":[]}
["1"]
["เดือน",null,{"$f":"  VLOOKUP(C5,TblMonth12,2,0)   &\"  \"&'Print (3)'!C6","v":"มกราคม  2569"},null,null,"( แบบจ่าย 1 งวด / เดือน)"]
[]
["วันที่จ่ายเงินเดือน",null,244484,null,"แสดงตัวอย่างลำดับที่",1]
["ประจำงวดเดือน",null,{"$f":"A1+0","v":1},null,"Email",{"$f":"IFERROR(Sheet1!F38,\"No Data\")","v":"puttachart@yahoo.com"}]
["ปี(เปลี่ยนเป็นปีปัจุบัน)",null,"2569",null,"เลขประจำตัว",{"$f":"IFERROR(Sheet1!B38,\"No Data\")","v":"69002"}]
{"$rows_left_out":5}
{"sheet":"Print","index":5,"n_rows":10,"n_cols":6,"rows_kept":10,"cut":false,"hidden":false,"merged":[]}
["1"]
["เดือน",null,{"$f":"  VLOOKUP(C5,TblMonth12,2,0)   &\"  \"&Print!C6","v":"มกราคม  2569"},null,null,"( แบบจ่าย 1 งวด / เดือน)"]
[]
["วันที่จ่ายเงินเดือน",null,244484,null,"แสดงตัวอย่างลำดับที่",2]
["ประจำงวดเดือน",null,{"$f":"A1+0","v":1},null,"Email",{"$f":"IFERROR(Sheet1!F38,\"No Data\")","v":"puttachart@yahoo.com"}]
["ปี(เปลี่ยนเป็นปีปัจุบัน)",null,"2569",null,"เลขประจำตัว",{"$f":"IFERROR(Sheet1!B38,\"No Data\")","v":"69002"}]
{"$rows_left_out":5}
{"sheet":"Sheet2","index":6,"n_rows":70,"n_cols":71,"rows_kept":70,"cut":false,"hidden":true,"merged":[]}
[{"$f":"DuenTee","v":1},1,"มกราคม",{"$f":"IFERROR(COUNT('1'!#REF!),0)","v":0},{"$f":"IFERROR(VLOOKUP(EmpID,'1'!#REF!,32,0),0)","v":0},{"$f":"E1","v":0},{"$f":"IFERROR(VLOOKUP(EmpID,'1'!#REF!,34,0),0)","v":0},{"$f":"G1","v":0},{"$f":"IFERROR(VLOOKUP(EmpID,'1'!#REF!,33,0),0)","v":0},{"$f":"I1","v":0},{"$f":"IFERROR(VLOOKUP(EmpID,'1'!#REF!,35,0),0)","v":0},{"$f":"K1","v":0},{"$f":"IFERROR(VLOOKUP(EmpID,'1'!#REF!,52,0),0)","v":0},{"$f":"M1","v":0},{"$f":"IFERROR(VLOOKUP(EmpID,'1'!#REF!,53,0),0)","v":0},{"$f":"O1","v":0},{"$f":"IFERROR(VLOOKUP(EmpID,'1'!#REF!,54,0),0)","v":0},{"$f":"Q1","v":0},{"$f":"IFERROR(VLOOKUP(EmpID,'1'!#REF!,55,0),0)","v":0},{"$f":"S1","v":0}]
[{"$f":"No","v":2},2,"มกราคม",{"$f":"IFERROR(COUNT('2'!#REF!),0)","v":0},{"$f":"IFERROR(VLOOKUP(EmpID,'2'!#REF!,32,0),0)","v":0},{"$f":"SUM(E$1:$E2)","v":0},{"$f":"IFERROR(VLOOKUP(EmpID,'2'!#REF!,34,0),0)","v":0},{"$f":"IF(G2>0,SUM(G$1:$G2),0)","v":0},{"$f":"IFERROR(VLOOKUP(EmpID,'2'!#REF!,33,0),0)","v":0},{"$f":"IF(I2>0,SUM(I$1:$I2),0)","v":0},{"$f":"IFERROR(VLOOKUP(EmpID,'2'!#REF!,35,0),0)","v":0},{"$f":"IF(K2>0,SUM($K$1:K2),0)","v":0},{"$f":"IFERROR(VLOOKUP(EmpID,'2'!#REF!,52,0),0)","v":0},{"$f":"SUM(M$1:$M2)","v":0},{"$f":"IFERROR(VLOOKUP(EmpID,'2'!#REF!,53,0),0)","v":0},{"$f":"SUM(O$1:$O2)","v":0},{"$f":"IFERROR(VLOOKUP(EmpID,'2'!#REF!,54,0),0)","v":0},{"$f":"SUM(Q$1:$Q2)","v":0},{"$f":"IFERROR(VLOOKUP(EmpID,'2'!#REF!,55,0),0)","v":0},{"$f":"SUM(S$1:$S2)","v":0}]
[{"$f":"EmpID","v":"69002"},3,"กุมภาพันธ์",{"$f":"IFERROR(COUNT('3'!#REF!),0)","v":0},{"$f":"IFERROR(VLOOKUP(EmpID,'3'!#REF!,32,0),0)","v":0},{"$f":"SUM(E$1:$E3)","v":0},{"$f":"IFERROR(VLOOKUP(EmpID,'3'!#REF!,34,0),0)","v":0},{"$f":"IF(G3>0,SUM(G$1:$G3),0)","v":0},{"$f":"IFERROR(VLOOKUP(EmpID,'3'!#REF!,33,0),0)","v":0},{"$f":"IF(I3>0,SUM(I$1:$I3),0)","v":0},{"$f":"IFERROR(VLOOKUP(EmpID,'3'!#REF!,35,0),0)","v":0},{"$f":"IF(K3>0,SUM($K$1:K3),0)","v":0},{"$f":"IFERROR(VLOOKUP(EmpID,'3'!#REF!,52,0),0)","v":0},{"$f":"SUM(M$1:$M3)","v":0},{"$f":"IFERROR(VLOOKUP(EmpID,'3'!#REF!,53,0),0)","v":0},{"$f":"SUM(O$1:$O3)","v":0},{"$f":"IFERROR(VLOOKUP(EmpID,'3'!#REF!,54,0),0)","v":0},{"$f":"SUM(Q$1:$Q3)","v":0},{"$f":"IFERROR(VLOOKUP(EmpID,'3'!#REF!,55,0),0)","v":0},{"$f":"SUM(S$1:$S3)","v":0}]
[null,4,"กุมภาพันธ์",{"$f":"IFERROR(COUNT('4'!#REF!),0)","v":0},{"$f":"IFERROR(VLOOKUP(EmpID,'4'!#REF!,32,0),0)","v":0},{"$f":"SUM(E$1:$E4)","v":0},{"$f":"IFERROR(VLOOKUP(EmpID,'4'!#REF!,34,0),0)","v":0},{"$f":"IF(G4>0,SUM(G$1:$G4),0)","v":0},{"$f":"IFERROR(VLOOKUP(EmpID,'4'!#REF!,33,0),0)","v":0},{"$f":"IF(I4>0,SUM(I$1:$I4),0)","v":0},{"$f":"IFERROR(VLOOKUP(EmpID,'4'!#REF!,35,0),0)","v":0},{"$f":"IF(K4>0,SUM($K$1:K4),0)","v":0},{"$f":"IFERROR(VLOOKUP(EmpID,'4'!#REF!,52,0),0)","v":0},{"$f":"SUM(M$1:$M4)","v":0},{"$f":"IFERROR(VLOOKUP(EmpID,'4'!#REF!,53,0),0)","v":0},{"$f":"SUM(O$1:$O4)","v":0},{"$f":"IFERROR(VLOOKUP(EmpID,'4'!#REF!,54,0),0)","v":0},{"$f":"SUM(Q$1:$Q4)","v":0},{"$f":"IFERROR(VLOOKUP(EmpID,'4'!#REF!,55,0),0)","v":0},{"$f":"SUM(S$1:$S4)","v":0}]
[null,5,"มีนาคม",{"$f":"IFERROR(COUNT('5'!#REF!),0)","v":0},{"$f":"IFERROR(VLOOKUP(EmpID,'5'!#REF!,32,0),0)","v":0},{"$f":"SUM(E$1:$E5)","v":0},{"$f":"IFERROR(VLOOKUP(EmpID,'5'!#REF!,34,0),0)","v":0},{"$f":"IF(G5>0,SUM(G$1:$G5),0)","v":0},{"$f":"IFERROR(VLOOKUP(EmpID,'5'!#REF!,33,0),0)","v":0},{"$f":"IF(I5>0,SUM(I$1:$I5),0)","v":0},{"$f":"IFERROR(VLOOKUP(EmpID,'5'!#REF!,35,0),0)","v":0},{"$f":"IF(K5>0,SUM($K$1:K5),0)","v":0},{"$f":"IFERROR(VLOOKUP(EmpID,'5'!#REF!,52,0),0)","v":0},{"$f":"SUM(M$1:$M5)","v":0},{"$f":"IFERROR(VLOOKUP(EmpID,'5'!#REF!,53,0),0)","v":0},{"$f":"SUM(O$1:$O5)","v":0},{"$f":"IFERROR(VLOOKUP(EmpID,'5'!#REF!,54,0),0)","v":0},{"$f":"SUM(Q$1:$Q5)","v":0},{"$f":"IFERROR(VLOOKUP(EmpID,'5'!#REF!,55,0),0)","v":0},{"$f":"SUM(S$1:$S5)","v":0}]
[null,6,"มีนาคม",{"$f":"IFERROR(COUNT('6'!A:A),0)","v":0},{"$f":"IFERROR(VLOOKUP(EmpID,'6'!$B:$AS,32,0),0)","v":0},{"$f":"SUM(E$1:$E6)","v":0},{"$f":"IFERROR(VLOOKUP(EmpID,'6'!$B:$AI,34,0),0)","v":0},{"$f":"IF(G6>0,SUM(G$1:$G6),0)","v":0},{"$f":"IFERROR(VLOOKUP(EmpID,'6'!$B:$AH,33,0),0)","v":0},{"$f":"IF(I6>0,SUM(I$1:$I6),0)","v":0},{"$f":"IFERROR(VLOOKUP(EmpID,'6'!$B:$AJ,35,0),0)","v":0},{"$f":"IF(K6>0,SUM($K$1:K6),0)","v":0},{"$f":"IFERROR(VLOOKUP(EmpID,'6'!$B:$BZ,52,0),0)","v":0},{"$f":"SUM(M$1:$M6)","v":0},{"$f":"IFERROR(VLOOKUP(EmpID,'6'!$B:$BZ,53,0),0)","v":0},{"$f":"SUM(O$1:$O6)","v":0},{"$f":"IFERROR(VLOOKUP(EmpID,'6'!$B:$BZ,54,0),0)","v":0},{"$f":"SUM(Q$1:$Q6)","v":0},{"$f":"IFERROR(VLOOKUP(EmpID,'6'!$B:$BZ,55,0),0)","v":0},{"$f":"SUM(S$1:$S6)","v":0}]
{"$rows_left_out":65}
{"sheet":"Sheet1","index":7,"n_rows":70,"n_cols":88,"rows_kept":70,"cut":false,"hidden":true,"merged":[]}
[{"$f":"DuenTee","v":1},1,"มกราคม",{"$f":"IFERROR(COUNT('1'!A:A),0)","v":3},{"$f":"IFERROR(VLOOKUP(EmpID,'1'!$B:$BB,41,0),0)","v":9996},{"$f":"E1","v":9996},{"$f":"IFERROR(VLOOKUP(EmpID,'1'!$B:$BH,43,0),0)","v":0},{"$f":"G1","v":0},{"$f":"IFERROR(VLOOKUP(EmpID,'1'!$B:$BH,42,0),0)","v":375},{"$f":"I1","v":375},{"$f":"IFERROR(VLOOKUP(EmpID,'1'!$B:$BH,44,0),0)","v":0},{"$f":"K1","v":0},{"$f":"IFERROR(VLOOKUP(EmpID,'1'!$B:$CI,52,0),0)","v":0},{"$f":"M1","v":0},{"$f":"IFERROR(VLOOKUP(EmpID,'1'!$B:$CI,53,0),0)","v":0},{"$f":"O1","v":0},{"$f":"IFERROR(VLOOKUP(EmpID,'1'!$B:$CI,54,0),0)","v":0},{"$f":"Q1","v":0},{"$f":"IFERROR(VLOOKUP(EmpID,'1'!$B:$CI,55,0),0)","v":0},{"$f":"S1","v":0}]
[{"$f":"No","v":2},2,"มกราคม",{"$f":"IFERROR(COUNT('2'!A:A),0)","v":0},{"$f":"IFERROR(VLOOKUP(EmpID,'2'!$B:$AS,41,0),0)","v":0},{"$f":"SUM(E$1:$E2)","v":9996},{"$f":"IFERROR(VLOOKUP(EmpID,'2'!$B:$AZ,43,0),0)","v":0},{"$f":"IF(G2>0,SUM(G$1:$G2),0)","v":0},{"$f":"IFERROR(VLOOKUP(EmpID,'2'!$B:$AZ,42,0),0)","v":0},{"$f":"IF(I2>0,SUM(I$1:$I2),0)","v":0},{"$f":"IFERROR(VLOOKUP(EmpID,'2'!$B:$AZ,44,0),0)","v":0},{"$f":"IF(K2>0,SUM($K$1:K2),0)","v":0},{"$f":"IFERROR(VLOOKUP(EmpID,'2'!$B:$BZ,52,0),0)","v":0},{"$f":"SUM(M$1:$M2)","v":0},{"$f":"IFERROR(VLOOKUP(EmpID,'2'!$B:$BZ,53,0),0)","v":0},{"$f":"SUM(O$1:$O2)","v":0},{"$f":"IFERROR(VLOOKUP(EmpID,'2'!$B:$BZ,54,0),0)","v":0},{"$f":"SUM(Q$1:$Q2)","v":0},{"$f":"IFERROR(VLOOKUP(EmpID,'2'!$B:$BZ,55,0),0)","v":0},{"$f":"SUM(S$1:$S2)","v":0}]
[{"$f":"EmpID","v":"69002"},3,"กุมภาพันธ์",{"$f":"IFERROR(COUNT('3'!A:A),0)","v":0},{"$f":"IFERROR(VLOOKUP(EmpID,'3'!$B:$AS,41,0),0)","v":0},{"$f":"SUM(E$1:$E3)","v":9996},{"$f":"IFERROR(VLOOKUP(EmpID,'3'!$B:$AZ,43,0),0)","v":0},{"$f":"IF(G3>0,SUM(G$1:$G3),0)","v":0},{"$f":"IFERROR(VLOOKUP(EmpID,'3'!$B:$AZ,42,0),0)","v":0},{"$f":"IF(I3>0,SUM(I$1:$I3),0)","v":0},{"$f":"IFERROR(VLOOKUP(EmpID,'3'!$B:$AZ,44,0),0)","v":0},{"$f":"IF(K3>0,SUM($K$1:K3),0)","v":0},{"$f":"IFERROR(VLOOKUP(EmpID,'3'!$B:$BZ,52,0),0)","v":0},{"$f":"SUM(M$1:$M3)","v":0},{"$f":"IFERROR(VLOOKUP(EmpID,'3'!$B:$BZ,53,0),0)","v":0},{"$f":"SUM(O$1:$O3)","v":0},{"$f":"IFERROR(VLOOKUP(EmpID,'3'!$B:$BZ,54,0),0)","v":0},{"$f":"SUM(Q$1:$Q3)","v":0},{"$f":"IFERROR(VLOOKUP(EmpID,'3'!$B:$BZ,55,0),0)","v":0},{"$f":"SUM(S$1:$S3)","v":0}]
[null,4,"กุมภาพันธ์",{"$f":"IFERROR(COUNT('4'!A:A),0)","v":0},{"$f":"IFERROR(VLOOKUP(EmpID,'4'!$B:$AS,41,0),0)","v":0},{"$f":"SUM(E$1:$E4)","v":9996},{"$f":"IFERROR(VLOOKUP(EmpID,'4'!$B:$AZ,43,0),0)","v":0},{"$f":"IF(G4>0,SUM(G$1:$G4),0)","v":0},{"$f":"IFERROR(VLOOKUP(EmpID,'4'!$B:$AZ,42,0),0)","v":0},{"$f":"IF(I4>0,SUM(I$1:$I4),0)","v":0},{"$f":"IFERROR(VLOOKUP(EmpID,'4'!$B:$AZ,44,0),0)","v":0},{"$f":"IF(K4>0,SUM($K$1:K4),0)","v":0},{"$f":"IFERROR(VLOOKUP(EmpID,'4'!$B:$BZ,52,0),0)","v":0},{"$f":"SUM(M$1:$M4)","v":0},{"$f":"IFERROR(VLOOKUP(EmpID,'4'!$B:$BZ,53,0),0)","v":0},{"$f":"SUM(O$1:$O4)","v":0},{"$f":"IFERROR(VLOOKUP(EmpID,'4'!$B:$BZ,54,0),0)","v":0},{"$f":"SUM(Q$1:$Q4)","v":0},{"$f":"IFERROR(VLOOKUP(EmpID,'4'!$B:$BZ,55,0),0)","v":0},{"$f":"SUM(S$1:$S4)","v":0}]
[null,5,"มีนาคม",{"$f":"IFERROR(COUNT('5'!A:A),0)","v":0},{"$f":"IFERROR(VLOOKUP(EmpID,'5'!$B:$AS,41,0),0)","v":0},{"$f":"SUM(E$1:$E5)","v":9996},{"$f":"IFERROR(VLOOKUP(EmpID,'5'!$B:$AZ,43,0),0)","v":0},{"$f":"IF(G5>0,SUM(G$1:$G5),0)","v":0},{"$f":"IFERROR(VLOOKUP(EmpID,'5'!$B:$AZ,42,0),0)","v":0},{"$f":"IF(I5>0,SUM(I$1:$I5),0)","v":0},{"$f":"IFERROR(VLOOKUP(EmpID,'5'!$B:$AZ,44,0),0)","v":0},{"$f":"IF(K5>0,SUM($K$1:K5),0)","v":0},{"$f":"IFERROR(VLOOKUP(EmpID,'5'!$B:$BZ,52,0),0)","v":0},{"$f":"SUM(M$1:$M5)","v":0},{"$f":"IFERROR(VLOOKUP(EmpID,'5'!$B:$BZ,53,0),0)","v":0},{"$f":"SUM(O$1:$O5)","v":0},{"$f":"IFERROR(VLOOKUP(EmpID,'5'!$B:$BZ,54,0),0)","v":0},{"$f":"SUM(Q$1:$Q5)","v":0},{"$f":"IFERROR(VLOOKUP(EmpID,'5'!$B:$BZ,55,0),0)","v":0},{"$f":"SUM(S$1:$S5)","v":0}]
[null,6,"มีนาคม",{"$f":"IFERROR(COUNT('6'!A:A),0)","v":0},{"$f":"IFERROR(VLOOKUP(EmpID,'6'!$B:$AS,41,0),0)","v":0},{"$f":"SUM(E$1:$E6)","v":9996},{"$f":"IFERROR(VLOOKUP(EmpID,'6'!$B:$AZ,43,0),0)","v":0},{"$f":"IF(G6>0,SUM(G$1:$G6),0)","v":0},{"$f":"IFERROR(VLOOKUP(EmpID,'6'!$B:$AZ,42,0),0)","v":0},{"$f":"IF(I6>0,SUM(I$1:$I6),0)","v":0},{"$f":"IFERROR(VLOOKUP(EmpID,'6'!$B:$AZ,44,0),0)","v":0},{"$f":"IF(K6>0,SUM($K$1:K6),0)","v":0},{"$f":"IFERROR(VLOOKUP(EmpID,'6'!$B:$BZ,52,0),0)","v":0},{"$f":"SUM(M$1:$M6)","v":0},{"$f":"IFERROR(VLOOKUP(EmpID,'6'!$B:$BZ,53,0),0)","v":0},{"$f":"SUM(O$1:$O6)","v":0},{"$f":"IFERROR(VLOOKUP(EmpID,'6'!$B:$BZ,54,0),0)","v":0},{"$f":"SUM(Q$1:$Q6)","v":0},{"$f":"IFERROR(VLOOKUP(EmpID,'6'!$B:$BZ,55,0),0)","v":0},{"$f":"SUM(S$1:$S6)","v":0}]
{"$rows_left_out":65}
{"sheet":"1","index":8,"n_rows":4,"n_cols":75,"rows_kept":4,"cut":false,"hidden":false,"merged":[]}
["ลำดับที่","รหัสพนักงาน","คำนำหน้า","ชื่อ","นามสกุล","Email","ตำแหน่ง","ธนาคาร","เลขที่บัญชีธนาคาร","วันที่เข้างาน","LineUser ID","ค่าแรง","จำนวนวันทำงาน","เงินเดือน/ค่าแรง","OT 1 เท่า (ชม.)","จำนวน","OT 1.5 เท่า (ชม.)","จำนวน","OT 2.0 เท่า (ชม.)","จำนวน","OT 3.0 เท่า (ชม.)","จำนวน","รวม OT","Commission","ค่าเบี้ยขยัน","ค่าเบี้ยเลี้ยง","ค่าโทรศัพท์","ค่าเดินทาง/ค่าพาหนะ","เงินโบนัส","อื่นๆ","อื่นๆ","อื่นๆ",null,null,null,null,null,null,null,null,null,"รวมรายได้","ประกันสังคม","ภาษี","กองทุนสำรองเลี้ยงชีพ","หักกองทุน %","หัก  กยศ","หักลาป่วย","หักมาสาย","หักลากิจ","หักลาอื่นๆ","หักค่าใช้จ่ายอื่นๆ","เบิกเงินเดือนล่วงหน้า","ธรรมเนียม",null,null,null,null,"รวมรายการหัก(ไม่รวมภาษี)","รวมรายการหัก","เงินได้สุทธิ","ลากิจ(ชม)","ลาป่วย(วัน)","พักร้อน(วัน)","ขาดงาน","ลดหย่อนรวมสุทธิ","ลดหย่อนรวม","ค่าใช้จ่ายเหมา 50%","หักค่าลดหย่อนส่วนตัว","ประกันสังคม","ลดหย่อนพ่อแม่","ลดหย่อนลูก","ค่าเบี้ยประกัน","ดอกเบี้ยบ้าน","เพิ่มได้"]
[1,"69001","นาย","สมชาย","ใจดี","pdeeprom@gmail.com","กรรมการ","กสิกรไทย","150-0-55902-4",242605,null,357,19,6783,0,0,33,2208.9375,0,0,0,0,{"$f":"Table4210323232423456[[#This Row],[Column10]]+Table4210323232423456[[#This Row],[Column55]]+Table4210323232423456[[#This Row],[Column57]]+Table4210323232423456[[#This Row],[Column13]]","v":2208.9375},1,2,3,4,5,6,7,8,9,null,null,null,null,null,null,null,null,null,{"$f":"Table4210323232423456[[#This Row],[Column58]]+Table4210323232423456[[#This Row],[Column14]]+Table4210323232423456[[#This Row],[Column16]]+Table4210323232423456[[#This Row],[Column17]]+Table4210323232423456[[#This Row],[Column19]]+Table4210323232423456[[#This Row],[Column62]]+Table4210323232423456[[#This Row],[Column63]]+Table4210323232423456[[#This Row],[Column64]]+Table4210323232423456[[#This Row],[Column65]]+Table4210323232423456[[#This Row],[Column66]]+Table4210323232423456[[#This Row],[Column41]]","v":9011.9375},375,{"$f":"taxcal(Table4210323232423456[[#This Row],[Column67]],Table4210323232423456[[#This Row],[Column32]])","v":0},null,null,0,null,null,null,null,null,2000,null,null,null,null,null,{"$f":"Table4210323232423456[[#This Row],[Column20]]+Table4210323232423456[[#This Row],[Column24]]+Table4210323232423456[[#This Row],[Column25]]+Table4210323232423456[[#This Row],[Column26]]+Table4210323232423456[[#This Row],[Column27]]+Table4210323232423456[[#This Row],[Column28]]+Table4210323232423456[[#This Row],[Column29]]+Table4210323232423456[[#This Row],[Column72]]+Table4210323232423456[[#This Row],[Column73]]+Table4210323232423456[[#This Row],[Column74]]+Table4210323232423456[[#This Row],[Column75]]+Table4210323232423456[[#This Row],[Column76]]+Table4210323232423456[[#This Row],[Column77]]+Table4210323232423456[[#This Row],[Column22]]","v":2375},{"$f":"Table4210323232423456[[#This Row],[Column20]]+Table4210323232423456[[#This Row],[Column21]]+Table4210323232423456[[#This Row],[Column24]]+Table4210323232423456[[#This Row],[Column25]]+Table4210323232423456[[#This Row],[Column26]]+Table4210323232423456[[#This Row],[Column27]]+Table4210323232423456[[#This Row],[Column28]]+Table4210323232423456[[#This Row],[Column29]]+Table4210323232423456[[#This Row],[Column72]]+Table4210323232423456[[#This Row],[Column73]]+Table4210323232423456[[#This Row],[Column74]]+Table4210323232423456[[#This Row],[Column75]]+Table4210323232423456[[#This Row],[Column76]]+Table4210323232423456[[#This Row],[Column77]]+Table4210323232423456[[#This Row],[Column22]]","v":2375},7940.9375,null,null,null,null,null,null,null,60000,{"$f":"Table4210323232423456[[#This Row],[Column20]]*12","v":4500}]
[2,"69002","นางสาว","สมหญิง","บุญรักษา","puttachart@yahoo.com","บัญชี","ไทยพาณิชย์","765-0-41698-4",241726,null,357,18,6426,0,0,48,3213,0,0,0,0,{"$f":"Table4210323232423456[[#This Row],[Column10]]+Table4210323232423456[[#This Row],[Column55]]+Table4210323232423456[[#This Row],[Column57]]+Table4210323232423456[[#This Row],[Column13]]","v":3213},1,357,0,0,null,null,null,null,null,null,null,null,null,null,null,null,null,null,{"$f":"Table4210323232423456[[#This Row],[Column58]]+Table4210323232423456[[#This Row],[Column14]]+Table4210323232423456[[#This Row],[Column16]]+Table4210323232423456[[#This Row],[Column17]]+Table4210323232423456[[#This Row],[Column19]]+Table4210323232423456[[#This Row],[Column62]]+Table4210323232423456[[#This Row],[Column63]]+Table4210323232423456[[#This Row],[Column64]]+Table4210323232423456[[#This Row],[Column65]]+Table4210323232423456[[#This Row],[Column66]]+Table4210323232423456[[#This Row],[Column41]]","v":9996},375,0,null,null,0,null,null,null,null,null,0,null,null,null,null,null,{"$f":"Table4210323232423456[[#This Row],[Column20]]+Table4210323232423456[[#This Row],[Column24]]+Table4210323232423456[[#This Row],[Column25]]+Table4210323232423456[[#This Row],[Column26]]+Table4210323232423456[[#This Row],[Column27]]+Table4210323232423456[[#This Row],[Column28]]+Table4210323232423456[[#This Row],[Column29]]+Table4210323232423456[[#This Row],[Column72]]+Table4210323232423456[[#This Row],[Column73]]+Table4210323232423456[[#This Row],[Column74]]+Table4210323232423456[[#This Row],[Column75]]+Table4210323232423456[[#This Row],[Column76]]+Table4210323232423456[[#This Row],[Column77]]","v":375},{"$f":"Table4210323232423456[[#This Row],[Column20]]+Table4210323232423456[[#This Row],[Column21]]+Table4210323232423456[[#This Row],[Column24]]+Table4210323232423456[[#This Row],[Column25]]+Table4210323232423456[[#This Row],[Column26]]+Table4210323232423456[[#This Row],[Column27]]+Table4210323232423456[[#This Row],[Column28]]+Table4210323232423456[[#This Row],[Column29]]+Table4210323232423456[[#This Row],[Column72]]+Table4210323232423456[[#This Row],[Column73]]+Table4210323232423456[[#This Row],[Column74]]+Table4210323232423456[[#This Row],[Column75]]+Table4210323232423456[[#This Row],[Column76]]+Table4210323232423456[[#This Row],[Column77]]","v":375},10335,null,null,null,null,null,null,null,60000,{"$f":"Table4210323232423456[[#This Row],[Column20]]*12","v":4500}]
[3,"69003","นาย","นเดชน์","คุนานนท์","puttobecon@gmail.com","พนักงานทั่วไป","กรุงเทพ","225-0-33166-9",239456,null,357,20,7140,0,0,51,3413.8125,16,1428,0,0,{"$f":"Table4210323232423456[[#This Row],[Column10]]+Table4210323232423456[[#This Row],[Column55]]+Table4210323232423456[[#This Row],[Column57]]+Table4210323232423456[[#This Row],[Column13]]","v":4841.8125},0,0,0,0,null,null,null,null,null,null,null,null,null,null,null,null,null,null,{"$f":"Table4210323232423456[[#This Row],[Column58]]+Table4210323232423456[[#This Row],[Column14]]+Table4210323232423456[[#This Row],[Column16]]+Table4210323232423456[[#This Row],[Column17]]+Table4210323232423456[[#This Row],[Column19]]+Table4210323232423456[[#This Row],[Column62]]+Table4210323232423456[[#This Row],[Column63]]+Table4210323232423456[[#This Row],[Column64]]+Table4210323232423456[[#This Row],[Column65]]+Table4210323232423456[[#This Row],[Column66]]+Table4210323232423456[[#This Row],[Column41]]","v":11981.8125},393,0,null,null,0,null,null,null,null,null,0,null,null,null,null,null,{"$f":"Table4210323232423456[[#This Row],[Column20]]+Table4210323232423456[[#This Row],[Column24]]+Table4210323232423456[[#This Row],[Column25]]+Table4210323232423456[[#This Row],[Column26]]+Table4210323232423456[[#This Row],[Column27]]+Table4210323232423456[[#This Row],[Column28]]+Table4210323232423456[[#This Row],[Column29]]+Table4210323232423456[[#This Row],[Column72]]+Table4210323232423456[[#This Row],[Column73]]+Table4210323232423456[[#This Row],[Column74]]+Table4210323232423456[[#This Row],[Column75]]+Table4210323232423456[[#This Row],[Column76]]+Table4210323232423456[[#This Row],[Column77]]+Table4210323232423456[[#This Row],[Column22]]","v":393},{"$f":"Table4210323232423456[[#This Row],[Column20]]+Table4210323232423456[[#This Row],[Column21]]+Table4210323232423456[[#This Row],[Column24]]+Table4210323232423456[[#This Row],[Column25]]+Table4210323232423456[[#This Row],[Column26]]+Table4210323232423456[[#This Row],[Column27]]+Table4210323232423456[[#This Row],[Column28]]+Table4210323232423456[[#This Row],[Column29]]+Table4210323232423456[[#This Row],[Column72]]+Table4210323232423456[[#This Row],[Column73]]+Table4210323232423456[[#This Row],[Column74]]+Table4210323232423456[[#This Row],[Column75]]+Table4210323232423456[[#This Row],[Column76]]+Table4210323232423456[[#This Row],[Column77]]+Table4210323232423456[[#This Row],[Column22]]","v":393},14522.8125,null,null,null,null,null,null,null,60000,{"$f":"Table4210323232423456[[#This Row],[Column20]]*12","v":4716}]

{"sheet":"2","index":9,"n_rows":0,"n_cols":0,"rows_kept":0,"cut":false,"hidden":false,"merged":[]}

{"sheet":"3","index":10,"n_rows":0,"n_cols":0,"rows_kept":0,"cut":false,"hidden":false,"merged":[]}

{"sheet":"4","index":11,"n_rows":0,"n_cols":0,"rows_kept":0,"cut":false,"hidden":false,"merged":[]}

{"sheet":"5","index":12,"n_rows":0,"n_cols":0,"rows_kept":0,"cut":false,"hidden":false,"merged":[]}

{"sheet":"6","index":13,"n_rows":0,"n_cols":0,"rows_kept":0,"cut":false,"hidden":false,"merged":[]}

{"sheet":"7","index":14,"n_rows":0,"n_cols":0,"rows_kept":0,"cut":false,"hidden":false,"merged":[]}

{"sheet":"8","index":15,"n_rows":0,"n_cols":0,"rows_kept":0,"cut":false,"hidden":false,"merged":[]}

{"sheet":"9","index":16,"n_rows":0,"n_cols":0,"rows_kept":0,"cut":false,"hidden":false,"merged":[]}

{"sheet":"10","index":17,"n_rows":0,"n_cols":0,"rows_kept":0,"cut":false,"hidden":false,"merged":[]}

{"sheet":"11","index":18,"n_rows":0,"n_cols":0,"rows_kept":0,"cut":false,"hidden":false,"merged":[]}

{"sheet":"12","index":19,"n_rows":0,"n_cols":0,"rows_kept":0,"cut":false,"hidden":false,"merged":[]}

{"sheet":"คู่มือ","index":20,"n_rows":25,"n_cols":4,"rows_kept":25,"cut":false,"hidden":false,"merged":[]}
[null,"https://www.cdnex.co.th/prog/userid.html",null,"ดู Line User Id ของเรานำ link เปิดบน line ของเรา"]
[]
[]
[]
[]
[]
{"$rows_left_out":19}