{"text_format":"1","workbook":"xlsx","n_sheets":29,"sheets":["Form","Form (2)","Print","Sheet1","คู่มือ","1","2","3","4","5","6","7","8","9","10","11","12","13","14","15","16","17","18","19","20","21","22","23","24"],"not_rendered":{"charts":0,"images":4,"macros":1,"external_links":0,"defined_names":23,"comments":2,"pivot_tables":0},"unopened":[],"bounds":{"document_bytes":16777216,"sheet_cells":100000,"rows_first":2000,"rows_last":500,"rows_between":2000,"halvings":0,"cell_chars":16384,"cell_head_chars":4096},"cells_cut":0,"cells_raw":0,"read":"whole","date_system":"1900"}

{"sheet":"Form","index":0,"n_rows":22,"n_cols":9,"rows_kept":22,"cut":false,"hidden":false,"merged":[[4,4,4,7],[21,8,21,9]]}
[]
[]
[]
[]
[]
[]
[]
[]
{"$rows_left_out":15}
{"sheet":"Form (2)","index":1,"n_rows":0,"n_cols":0,"rows_kept":0,"cut":false,"hidden":true,"merged":[]}

{"sheet":"Print","index":2,"n_rows":10,"n_cols":6,"rows_kept":10,"cut":false,"hidden":false,"merged":[]}
["1",null,{"$f":"VLOOKUP(C5,TblMonthPeriod,2,0)&\"  \"&  VLOOKUP(C5,TblMonthPeriod,3,0)   &\"  \"&Print!C6","v":"1-15  มกราคม  2565"},null,{"$f":"VLOOKUP(C5,TblMonth12,2,0)&\" \"&Print!C6","v":"มกราคม 2565"}]
["เดือน",null,{"$f":"VLOOKUP(C5,TblMonthPeriod,2,0)&\"  \"&  VLOOKUP(C5,TblMonthPeriod,3,0)   &\"  \"&Print!C6","v":"1-15  มกราคม  2565"},null,null,"( แบบจ่าย 2 งวด / เดือน)"]
[]
["วันที่จ่าย",null,"16 กุมภาพันธ์ 2565",null,"แสดงตัวอย่างลำดับที่",1]
["ประจำงวดเดือน",null,{"$f":"A1+0","v":1}]
["ปี(เปลี่ยนเป็นปีปัจุบัน)",null,"2565",null,"เลขประจำตัว",{"$f":"IFERROR(Sheet1!B38,\"No Data\")","v":63001}]
["จำนวนพนักงานทั้งหมด",null,{"$f":"VLOOKUP(C5,TblMonthData,3,0)","v":11},null,"ชื่อ",{"$f":"IFERROR(Sheet1!C38&Sheet1!D38&\" \"&Sheet1!E38,\"No Data\")","v":"นางณเดชน์ วงษ์พันธ์"}]
["เริ่มพิมพ์จากลำดับที่",null,1,null,"ตำแหน่ง",{"$f":"IFERROR(Sheet1!G38,\"No Data\")","v":"เจ้าหน้าที่อาวุโส"}]
{"$rows_left_out":3}
{"sheet":"Sheet1","index":3,"n_rows":70,"n_cols":67,"rows_kept":70,"cut":false,"hidden":true,"merged":[]}
[{"$f":"DuenTee","v":1},1,"มกราคม",{"$f":"IFERROR(COUNT('1'!A:A),0)","v":11},{"$f":"IFERROR(VLOOKUP(EmpID,'1'!$B:$AS,32,0),0)","v":11254.166666666666},{"$f":"E1","v":11254.166666666666},{"$f":"IFERROR(VLOOKUP(EmpID,'1'!$B:$AI,34,0),0)","v":0},{"$f":"G1","v":0},{"$f":"IFERROR(VLOOKUP(EmpID,'1'!$B:$AH,33,0),0)","v":500},{"$f":"I1","v":500},{"$f":"IFERROR(VLOOKUP(EmpID,'1'!$B:$AJ,35,0),0)","v":0},{"$f":"K1","v":0}]
[{"$f":"No","v":1},2,"มกราคม",{"$f":"IFERROR(COUNT('2'!A:A),0)","v":0},{"$f":"IFERROR(VLOOKUP(EmpID,'2'!$B:$AS,32,0),0)","v":0},{"$f":"IF(E2>0,SUM(E$1:$E2),0)","v":0},{"$f":"IFERROR(VLOOKUP(EmpID,'2'!$B:$AI,34,0),0)","v":0},{"$f":"IF(G2>0,SUM(G$1:$G2),0)","v":0},{"$f":"IFERROR(VLOOKUP(EmpID,'2'!$B:$AH,33,0),0)","v":0},{"$f":"IF(I2>0,SUM(I$1:$I2),0)","v":0},{"$f":"IFERROR(VLOOKUP(EmpID,'2'!$B:$AJ,35,0),0)","v":0},{"$f":"IF(K2>0,SUM($K$1:K2),0)","v":0}]
[{"$f":"EmpID","v":63001},3,"กุมภาพันธ์",{"$f":"IFERROR(COUNT('3'!A:A),0)","v":0},{"$f":"IFERROR(VLOOKUP(EmpID,'3'!$B:$AS,32,0),0)","v":0},{"$f":"IF(E3>0,SUM(E$1:$E3),0)","v":0},{"$f":"IFERROR(VLOOKUP(EmpID,'3'!$B:$AI,34,0),0)","v":0},{"$f":"IF(G3>0,SUM(G$1:$G3),0)","v":0},{"$f":"IFERROR(VLOOKUP(EmpID,'3'!$B:$AH,33,0),0)","v":0},{"$f":"IF(I3>0,SUM(I$1:$I3),0)","v":0},{"$f":"IFERROR(VLOOKUP(EmpID,'3'!$B:$AJ,35,0),0)","v":0},{"$f":"IF(K3>0,SUM($K$1:K3),0)","v":0}]
[null,4,"กุมภาพันธ์",{"$f":"IFERROR(COUNT('4'!A:A),0)","v":0},{"$f":"IFERROR(VLOOKUP(EmpID,'4'!$B:$AS,32,0),0)","v":0},{"$f":"IF(E4>0,SUM(E$1:$E4),0)","v":0},{"$f":"IFERROR(VLOOKUP(EmpID,'4'!$B:$AI,34,0),0)","v":0},{"$f":"IF(G4>0,SUM(G$1:$G4),0)","v":0},{"$f":"IFERROR(VLOOKUP(EmpID,'4'!$B:$AH,33,0),0)","v":0},{"$f":"IF(I4>0,SUM(I$1:$I4),0)","v":0},{"$f":"IFERROR(VLOOKUP(EmpID,'4'!$B:$AJ,35,0),0)","v":0},{"$f":"IF(K4>0,SUM($K$1:K4),0)","v":0}]
[null,5,"มีนาคม",{"$f":"IFERROR(COUNT('5'!A:A),0)","v":0},{"$f":"IFERROR(VLOOKUP(EmpID,'5'!$B:$AS,32,0),0)","v":0},{"$f":"IF(E5>0,SUM(E$1:$E5),0)","v":0},{"$f":"IFERROR(VLOOKUP(EmpID,'5'!$B:$AI,34,0),0)","v":0},{"$f":"IF(G5>0,SUM(G$1:$G5),0)","v":0},{"$f":"IFERROR(VLOOKUP(EmpID,'5'!$B:$AH,33,0),0)","v":0},{"$f":"IF(I5>0,SUM(I$1:$I5),0)","v":0},{"$f":"IFERROR(VLOOKUP(EmpID,'5'!$B:$AJ,35,0),0)","v":0},{"$f":"IF(K5>0,SUM($K$1:K5),0)","v":0}]
[null,6,"มีนาคม",{"$f":"IFERROR(COUNT('6'!A:A),0)","v":0},{"$f":"IFERROR(VLOOKUP(EmpID,'6'!$B:$AS,32,0),0)","v":0},{"$f":"IF(E6>0,SUM(E$1:$E6),0)","v":0},{"$f":"IFERROR(VLOOKUP(EmpID,'6'!$B:$AI,34,0),0)","v":0},{"$f":"IF(G6>0,SUM(G$1:$G6),0)","v":0},{"$f":"IFERROR(VLOOKUP(EmpID,'6'!$B:$AH,33,0),0)","v":0},{"$f":"IF(I6>0,SUM(I$1:$I6),0)","v":0},{"$f":"IFERROR(VLOOKUP(EmpID,'6'!$B:$AJ,35,0),0)","v":0},{"$f":"IF(K6>0,SUM($K$1:K6),0)","v":0}]
[null,7,"เมษายน",{"$f":"IFERROR(COUNT('7'!A:A),0)","v":0},{"$f":"IFERROR(VLOOKUP(EmpID,'7'!$B:$AS,32,0),0)","v":0},{"$f":"IF(E7>0,SUM(E$1:$E7),0)","v":0},{"$f":"IFERROR(VLOOKUP(EmpID,'7'!$B:$AI,34,0),0)","v":0},{"$f":"IF(G7>0,SUM(G$1:$G7),0)","v":0},{"$f":"IFERROR(VLOOKUP(EmpID,'7'!$B:$AH,33,0),0)","v":0},{"$f":"IF(I7>0,SUM(I$1:$I7),0)","v":0},{"$f":"IFERROR(VLOOKUP(EmpID,'7'!$B:$AJ,35,0),0)","v":0},{"$f":"IF(K7>0,SUM($K$1:K7),0)","v":0}]
[null,8,"เมษายน",{"$f":"IFERROR(COUNT('8'!A:A),0)","v":0},{"$f":"IFERROR(VLOOKUP(EmpID,'8'!$B:$AS,32,0),0)","v":0},{"$f":"IF(E8>0,SUM(E$1:$E8),0)","v":0},{"$f":"IFERROR(VLOOKUP(EmpID,'8'!$B:$AI,34,0),0)","v":0},{"$f":"IF(G8>0,SUM(G$1:$G8),0)","v":0},{"$f":"IFERROR(VLOOKUP(EmpID,'8'!$B:$AH,33,0),0)","v":0},{"$f":"IF(I8>0,SUM(I$1:$I8),0)","v":0},{"$f":"IFERROR(VLOOKUP(EmpID,'8'!$B:$AJ,35,0),0)","v":0},{"$f":"IF(K8>0,SUM($K$1:K8),0)","v":0}]
{"$rows_left_out":63}
{"sheet":"คู่มือ","index":4,"n_rows":41,"n_cols":2,"rows_kept":41,"cut":false,"hidden":false,"merged":[]}
[]
[]
[]
[]
[]
[]
[]
[]
{"$rows_left_out":34}
{"sheet":"1","index":5,"n_rows":12,"n_cols":58,"rows_kept":12,"cut":false,"hidden":false,"merged":[]}
["ลำดับที่","รหัสพนักงาน","คำนำหน้า","ชื่อ","นามสกุล","แผนก","ตำแหน่ง","เลขที่บัญชี","วันที่เข้างาน",null,null,"ค่าแรง","จำนวนวันทำงาน","เงินเดือน/ค่าแรง","OT 1 เท่า (ชม.)",null,"OT 1.5 เท่า (ชม.)",null,"OT 2.0 เท่า (ชม.)",null,"OT 3.0 เท่า (ชม.)",null,"รวม OT","คอมมิสชั่น","เบี้ยขยัน","โบนัส","อื่นๆ ","เปลี่ยนได้2","เปลี่ยนได้3","เปลี่ยนได้4",null,null,"รวมรายได้","ประกันสังคม","ภาษี","กองทุนสำรองเลี้ยงชีพ","หักกองทุน %","กู้ยืม","สาย","อื่นๆ","xx","xxx","xxxx",null,"รวมรายการหัก(ไม่รวมภาษี)","รวมรายการหัก","เงินได้สุทธิ","เงินได้สุทธิ(หลังหักภาษี)","ลดหย่อนรวมสุทธิ","ลดหย่อนรวม","ค่าใช้จ่ายเหมา 50%","หักค่าลดหย่อนส่วนตัว","ประกันสังคม","ลดหย่อนพ่อแม่","ลดหย่อนลูก","ค่าเบี้ยประกัน","ดอกเบี้ยบ้าน","เพิ่มได้จนถึง bo"]
[1,63001,"นาง","ณเดชน์","วงษ์พันธ์","ธุรการ 总务","เจ้าหน้าที่อาวุโส","0652792944",43734,null,null,null,null,10000,2,{"$f":"(Table421032323[[#This Row],[Column58]]/30/8)*(Table421032323[[#This Row],[Column54]]*1)","v":83.333333333333329},1,{"$f":"(Table421032323[[#This Row],[Column58]]/30/8)*(Table421032323[[#This Row],[Column11]]*1.5)","v":62.5},1,{"$f":"(Table421032323[[#This Row],[Column58]]/30/8)*(Table421032323[[#This Row],[Column56]]*2)","v":83.333333333333329},1,{"$f":"(Table421032323[[#This Row],[Column58]]/30/8)*(Table421032323[[#This Row],[Column12]]*3)","v":125},{"$f":"Table421032323[[#This Row],[Column10]]+Table421032323[[#This Row],[Column55]]+Table421032323[[#This Row],[Column57]]+Table421032323[[#This Row],[Column13]]","v":354.16666666666663},200,300,400,null,null,null,null,null,null,{"$f":"Table421032323[[#This Row],[Column58]]+Table421032323[[#This Row],[Column14]]+Table421032323[[#This Row],[Column15]]+Table421032323[[#This Row],[Column16]]+Table421032323[[#This Row],[Column17]]+Table421032323[[#This Row],[Column19]]+Table421032323[[#This Row],[Column62]]+Table421032323[[#This Row],[Column63]]+Table421032323[[#This Row],[Column64]]+Table421032323[[#This Row],[Column65]]+Table421032323[[#This Row],[Column66]]","v":11254.166666666666},{"$f":"ROUND(IF(N2>15000,750,N2*5%),0)","v":500},{"$f":"TaxCal(AU2,AW2)","v":0},null,null,100,50,10,20,30,40,null,{"$f":"Table421032323[[#This Row],[Column20]]+Table421032323[[#This Row],[Column24]]+Table421032323[[#This Row],[Column25]]+Table421032323[[#This Row],[Column26]]+Table421032323[[#This Row],[Column27]]+Table421032323[[#This Row],[Column28]]+Table421032323[[#This Row],[Column29]]+Table421032323[[#This Row],[Column30]]","v":750},{"$f":"Table421032323[[#This Row],[Column31]]+Table421032323[[#This Row],[Column21]]","v":750},{"$f":"Table421032323[[#This Row],[Column67]]-Table421032323[[#This Row],[Column31]]","v":10504.166666666666},{"$f":"Table421032323[[#This Row],[Column70]]-Table421032323[[#This Row],[Column21]]","v":10504.166666666666},{"$f":"IF((AG2*12)-(SUM(AY2:BF2))<=0,0,(AG2*12)-(SUM(AY2:BF2)))","v":325},{"$f":"SUM(AY2:BF2)","v":134725},{"$f":"IF(((AG2*12)/2)>100000,100000,(AG2*12)/2)","v":67525},60000,7200]
[2,63002,"นางสาว","รัชฎาภรณ์","บุญญาศิรินันท์","จัดซื้อ 采购","ผู้จัดการแผนก","0652798721",43745,null,null,null,null,15000,null,{"$f":"(Table421032323[[#This Row],[Column58]]/30/8)*(Table421032323[[#This Row],[Column54]]*1)","v":0},null,{"$f":"(Table421032323[[#This Row],[Column58]]/30/8)*(Table421032323[[#This Row],[Column11]]*1.5)","v":0},null,{"$f":"(Table421032323[[#This Row],[Column58]]/30/8)*(Table421032323[[#This Row],[Column56]]*2)","v":0},null,{"$f":"(Table421032323[[#This Row],[Column58]]/30/8)*(Table421032323[[#This Row],[Column12]]*3)","v":0},{"$f":"Table421032323[[#This Row],[Column10]]+Table421032323[[#This Row],[Column55]]+Table421032323[[#This Row],[Column57]]+Table421032323[[#This Row],[Column13]]","v":0},0,0,4000,null,null,null,null,null,null,{"$f":"Table421032323[[#This Row],[Column58]]+Table421032323[[#This Row],[Column14]]+Table421032323[[#This Row],[Column15]]+Table421032323[[#This Row],[Column16]]+Table421032323[[#This Row],[Column17]]+Table421032323[[#This Row],[Column19]]+Table421032323[[#This Row],[Column62]]+Table421032323[[#This Row],[Column63]]+Table421032323[[#This Row],[Column64]]+Table421032323[[#This Row],[Column65]]+Table421032323[[#This Row],[Column66]]","v":19000},750,0,null,null,null,null,null,null,null,null,null,{"$f":"Table421032323[[#This Row],[Column20]]+Table421032323[[#This Row],[Column24]]+Table421032323[[#This Row],[Column25]]+Table421032323[[#This Row],[Column26]]+Table421032323[[#This Row],[Column27]]+Table421032323[[#This Row],[Column28]]+Table421032323[[#This Row],[Column29]]+Table421032323[[#This Row],[Column30]]","v":750},{"$f":"Table421032323[[#This Row],[Column31]]+Table421032323[[#This Row],[Column21]]","v":750},{"$f":"Table421032323[[#This Row],[Column67]]-Table421032323[[#This Row],[Column31]]","v":18250},{"$f":"Table421032323[[#This Row],[Column70]]-Table421032323[[#This Row],[Column21]]","v":18250},60800,167200,100000,60000,7200]
[3,63003,"นางสาว","ผุสดี","ปัทมภาสพงษ์","บุคคล 人事","ผู้จัดการแผนก","0652745806",43773,null,null,null,null,{"$f":"Table421032323[[#This Row],[Column60]]*Table421032323[[#This Row],[Column9]]","v":0},null,{"$f":"(Table421032323[[#This Row],[Column58]]/30/8)*(Table421032323[[#This Row],[Column54]]*1)","v":0},null,{"$f":"(Table421032323[[#This Row],[Column58]]/30/8)*(Table421032323[[#This Row],[Column11]]*1.5)","v":0},null,{"$f":"(Table421032323[[#This Row],[Column58]]/30/8)*(Table421032323[[#This Row],[Column56]]*2)","v":0},null,{"$f":"(Table421032323[[#This Row],[Column58]]/30/8)*(Table421032323[[#This Row],[Column12]]*3)","v":0},{"$f":"Table421032323[[#This Row],[Column10]]+Table421032323[[#This Row],[Column55]]+Table421032323[[#This Row],[Column57]]+Table421032323[[#This Row],[Column13]]","v":0},0,0,null,null,null,null,null,null,null,{"$f":"Table421032323[[#This Row],[Column58]]+Table421032323[[#This Row],[Column14]]+Table421032323[[#This Row],[Column15]]+Table421032323[[#This Row],[Column16]]+Table421032323[[#This Row],[Column17]]+Table421032323[[#This Row],[Column19]]+Table421032323[[#This Row],[Column62]]+Table421032323[[#This Row],[Column63]]+Table421032323[[#This Row],[Column64]]+Table421032323[[#This Row],[Column65]]+Table421032323[[#This Row],[Column66]]","v":0},0,0,null,null,200,100,3,4,5,6,null,{"$f":"Table421032323[[#This Row],[Column20]]+Table421032323[[#This Row],[Column24]]+Table421032323[[#This Row],[Column25]]+Table421032323[[#This Row],[Column26]]+Table421032323[[#This Row],[Column27]]+Table421032323[[#This Row],[Column28]]+Table421032323[[#This Row],[Column29]]+Table421032323[[#This Row],[Column30]]","v":318},{"$f":"Table421032323[[#This Row],[Column31]]+Table421032323[[#This Row],[Column21]]","v":318},{"$f":"Table421032323[[#This Row],[Column67]]-Table421032323[[#This Row],[Column31]]","v":-318},{"$f":"Table421032323[[#This Row],[Column70]]-Table421032323[[#This Row],[Column21]]","v":-318},0,67200,0,60000,7200]
[4,63004,"นาย","กฤษฎา","ธาราภูมิ","ธุรการ 总务","พนักงานขับรถ 司机","0658810863",43773,null,null,null,null,{"$f":"Table421032323[[#This Row],[Column60]]*Table421032323[[#This Row],[Column9]]","v":0},null,{"$f":"(Table421032323[[#This Row],[Column58]]/30/8)*(Table421032323[[#This Row],[Column54]]*1)","v":0},null,{"$f":"(Table421032323[[#This Row],[Column58]]/30/8)*(Table421032323[[#This Row],[Column11]]*1.5)","v":0},null,{"$f":"(Table421032323[[#This Row],[Column58]]/30/8)*(Table421032323[[#This Row],[Column56]]*2)","v":0},null,{"$f":"(Table421032323[[#This Row],[Column58]]/30/8)*(Table421032323[[#This Row],[Column12]]*3)","v":0},{"$f":"Table421032323[[#This Row],[Column10]]+Table421032323[[#This Row],[Column55]]+Table421032323[[#This Row],[Column57]]+Table421032323[[#This Row],[Column13]]","v":0},200,300,400,null,null,null,null,null,null,{"$f":"Table421032323[[#This Row],[Column58]]+Table421032323[[#This Row],[Column14]]+Table421032323[[#This Row],[Column15]]+Table421032323[[#This Row],[Column16]]+Table421032323[[#This Row],[Column17]]+Table421032323[[#This Row],[Column19]]+Table421032323[[#This Row],[Column62]]+Table421032323[[#This Row],[Column63]]+Table421032323[[#This Row],[Column64]]+Table421032323[[#This Row],[Column65]]+Table421032323[[#This Row],[Column66]]","v":900},0,0,null,null,null,null,null,null,null,null,null,{"$f":"Table421032323[[#This Row],[Column20]]+Table421032323[[#This Row],[Column24]]+Table421032323[[#This Row],[Column25]]+Table421032323[[#This Row],[Column26]]+Table421032323[[#This Row],[Column27]]+Table421032323[[#This Row],[Column28]]+Table421032323[[#This Row],[Column29]]+Table421032323[[#This Row],[Column30]]","v":0},{"$f":"Table421032323[[#This Row],[Column31]]+Table421032323[[#This Row],[Column21]]","v":0},{"$f":"Table421032323[[#This Row],[Column67]]-Table421032323[[#This Row],[Column31]]","v":900},{"$f":"Table421032323[[#This Row],[Column70]]-Table421032323[[#This Row],[Column21]]","v":900},0,72600,5400,60000,7200]
[5,63005,"นาง","ปัทมาภรณ์ ","แก้วโผงเผง","ธุรการ 总务","แม่บ้าน","0652792111",43774,null,null,null,null,{"$f":"Table421032323[[#This Row],[Column60]]*Table421032323[[#This Row],[Column9]]","v":0},null,{"$f":"(Table421032323[[#This Row],[Column58]]/30/8)*(Table421032323[[#This Row],[Column54]]*1)","v":0},null,{"$f":"(Table421032323[[#This Row],[Column58]]/30/8)*(Table421032323[[#This Row],[Column11]]*1.5)","v":0},null,{"$f":"(Table421032323[[#This Row],[Column58]]/30/8)*(Table421032323[[#This Row],[Column56]]*2)","v":0},null,{"$f":"(Table421032323[[#This Row],[Column58]]/30/8)*(Table421032323[[#This Row],[Column12]]*3)","v":0},{"$f":"Table421032323[[#This Row],[Column10]]+Table421032323[[#This Row],[Column55]]+Table421032323[[#This Row],[Column57]]+Table421032323[[#This Row],[Column13]]","v":0},700,0,null,null,null,null,null,null,null,{"$f":"Table421032323[[#This Row],[Column58]]+Table421032323[[#This Row],[Column14]]+Table421032323[[#This Row],[Column15]]+Table421032323[[#This Row],[Column16]]+Table421032323[[#This Row],[Column17]]+Table421032323[[#This Row],[Column19]]+Table421032323[[#This Row],[Column62]]+Table421032323[[#This Row],[Column63]]+Table421032323[[#This Row],[Column64]]+Table421032323[[#This Row],[Column65]]+Table421032323[[#This Row],[Column66]]","v":700},0,0,null,null,null,300,null,null,null,null,null,{"$f":"Table421032323[[#This Row],[Column20]]+Table421032323[[#This Row],[Column24]]+Table421032323[[#This Row],[Column25]]+Table421032323[[#This Row],[Column26]]+Table421032323[[#This Row],[Column27]]+Table421032323[[#This Row],[Column28]]+Table421032323[[#This Row],[Column29]]+Table421032323[[#This Row],[Column30]]","v":300},{"$f":"Table421032323[[#This Row],[Column31]]+Table421032323[[#This Row],[Column21]]","v":300},{"$f":"Table421032323[[#This Row],[Column67]]-Table421032323[[#This Row],[Column31]]","v":400},{"$f":"Table421032323[[#This Row],[Column70]]-Table421032323[[#This Row],[Column21]]","v":400},0,71400,4200,60000,7200]
[6,63006,"นาง","อรอนงค์","ปานดี","ธุรการ 总务","แม่บ้าน","0652774709",43774,null,null,null,null,{"$f":"Table421032323[[#This Row],[Column60]]*Table421032323[[#This Row],[Column9]]","v":0},null,{"$f":"(Table421032323[[#This Row],[Column58]]/30/8)*(Table421032323[[#This Row],[Column54]]*1)","v":0},null,{"$f":"(Table421032323[[#This Row],[Column58]]/30/8)*(Table421032323[[#This Row],[Column11]]*1.5)","v":0},null,{"$f":"(Table421032323[[#This Row],[Column58]]/30/8)*(Table421032323[[#This Row],[Column56]]*2)","v":0},null,{"$f":"(Table421032323[[#This Row],[Column58]]/30/8)*(Table421032323[[#This Row],[Column12]]*3)","v":0},{"$f":"Table421032323[[#This Row],[Column10]]+Table421032323[[#This Row],[Column55]]+Table421032323[[#This Row],[Column57]]+Table421032323[[#This Row],[Column13]]","v":0},900,0,null,null,null,null,null,null,null,{"$f":"Table421032323[[#This Row],[Column58]]+Table421032323[[#This Row],[Column14]]+Table421032323[[#This Row],[Column15]]+Table421032323[[#This Row],[Column16]]+Table421032323[[#This Row],[Column17]]+Table421032323[[#This Row],[Column19]]+Table421032323[[#This Row],[Column62]]+Table421032323[[#This Row],[Column63]]+Table421032323[[#This Row],[Column64]]+Table421032323[[#This Row],[Column65]]+Table421032323[[#This Row],[Column66]]","v":900},0,0,null,null,null,300,null,null,null,null,null,{"$f":"Table421032323[[#This Row],[Column20]]+Table421032323[[#This Row],[Column24]]+Table421032323[[#This Row],[Column25]]+Table421032323[[#This Row],[Column26]]+Table421032323[[#This Row],[Column27]]+Table421032323[[#This Row],[Column28]]+Table421032323[[#This Row],[Column29]]+Table421032323[[#This Row],[Column30]]","v":300},{"$f":"Table421032323[[#This Row],[Column31]]+Table421032323[[#This Row],[Column21]]","v":300},{"$f":"Table421032323[[#This Row],[Column67]]-Table421032323[[#This Row],[Column31]]","v":600},{"$f":"Table421032323[[#This Row],[Column70]]-Table421032323[[#This Row],[Column21]]","v":600},0,72600,5400,60000,7200]
[7,63007,"นาย","สุพล","แซ่เหมา","พ่นสี 1 油漆","ล่ามจีน","0652750303",43778,null,null,null,null,{"$f":"Table421032323[[#This Row],[Column60]]*Table421032323[[#This Row],[Column9]]","v":0},null,{"$f":"(Table421032323[[#This Row],[Column58]]/30/8)*(Table421032323[[#This Row],[Column54]]*1)","v":0},null,{"$f":"(Table421032323[[#This Row],[Column58]]/30/8)*(Table421032323[[#This Row],[Column11]]*1.5)","v":0},null,{"$f":"(Table421032323[[#This Row],[Column58]]/30/8)*(Table421032323[[#This Row],[Column56]]*2)","v":0},null,{"$f":"(Table421032323[[#This Row],[Column58]]/30/8)*(Table421032323[[#This Row],[Column12]]*3)","v":0},{"$f":"Table421032323[[#This Row],[Column10]]+Table421032323[[#This Row],[Column55]]+Table421032323[[#This Row],[Column57]]+Table421032323[[#This Row],[Column13]]","v":0},0,150,null,null,null,null,null,null,null,{"$f":"Table421032323[[#This Row],[Column58]]+Table421032323[[#This Row],[Column14]]+Table421032323[[#This Row],[Column15]]+Table421032323[[#This Row],[Column16]]+Table421032323[[#This Row],[Column17]]+Table421032323[[#This Row],[Column19]]+Table421032323[[#This Row],[Column62]]+Table421032323[[#This Row],[Column63]]+Table421032323[[#This Row],[Column64]]+Table421032323[[#This Row],[Column65]]+Table421032323[[#This Row],[Column66]]","v":150},0,0,null,null,null,null,null,null,null,null,null,{"$f":"Table421032323[[#This Row],[Column20]]+Table421032323[[#This Row],[Column24]]+Table421032323[[#This Row],[Column25]]+Table421032323[[#This Row],[Column26]]+Table421032323[[#This Row],[Column27]]+Table421032323[[#This Row],[Column28]]+Table421032323[[#This Row],[Column29]]+Table421032323[[#This Row],[Column30]]","v":0},{"$f":"Table421032323[[#This Row],[Column31]]+Table421032323[[#This Row],[Column21]]","v":0},{"$f":"Table421032323[[#This Row],[Column67]]-Table421032323[[#This Row],[Column31]]","v":150},{"$f":"Table421032323[[#This Row],[Column70]]-Table421032323[[#This Row],[Column21]]","v":150},0,68100,900,60000,7200]
{"$rows_left_out":5}
{"sheet":"2","index":6,"n_rows":0,"n_cols":0,"rows_kept":0,"cut":false,"hidden":false,"merged":[]}

{"sheet":"3","index":7,"n_rows":0,"n_cols":0,"rows_kept":0,"cut":false,"hidden":false,"merged":[]}

{"sheet":"4","index":8,"n_rows":0,"n_cols":0,"rows_kept":0,"cut":false,"hidden":false,"merged":[]}

{"sheet":"5","index":9,"n_rows":0,"n_cols":0,"rows_kept":0,"cut":false,"hidden":false,"merged":[]}

{"sheet":"6","index":10,"n_rows":0,"n_cols":0,"rows_kept":0,"cut":false,"hidden":false,"merged":[]}

{"sheet":"7","index":11,"n_rows":0,"n_cols":0,"rows_kept":0,"cut":false,"hidden":false,"merged":[]}

{"sheet":"8","index":12,"n_rows":0,"n_cols":0,"rows_kept":0,"cut":false,"hidden":false,"merged":[]}

{"sheet":"9","index":13,"n_rows":0,"n_cols":0,"rows_kept":0,"cut":false,"hidden":false,"merged":[]}

{"sheet":"10","index":14,"n_rows":0,"n_cols":0,"rows_kept":0,"cut":false,"hidden":false,"merged":[]}

{"sheet":"11","index":15,"n_rows":0,"n_cols":0,"rows_kept":0,"cut":false,"hidden":false,"merged":[]}

{"sheet":"12","index":16,"n_rows":0,"n_cols":0,"rows_kept":0,"cut":false,"hidden":false,"merged":[]}

{"sheet":"13","index":17,"n_rows":0,"n_cols":0,"rows_kept":0,"cut":false,"hidden":false,"merged":[]}

{"sheet":"14","index":18,"n_rows":0,"n_cols":0,"rows_kept":0,"cut":false,"hidden":false,"merged":[]}

{"sheet":"15","index":19,"n_rows":0,"n_cols":0,"rows_kept":0,"cut":false,"hidden":false,"merged":[]}

{"sheet":"16","index":20,"n_rows":0,"n_cols":0,"rows_kept":0,"cut":false,"hidden":false,"merged":[]}

{"sheet":"17","index":21,"n_rows":0,"n_cols":0,"rows_kept":0,"cut":false,"hidden":false,"merged":[]}

{"sheet":"18","index":22,"n_rows":0,"n_cols":0,"rows_kept":0,"cut":false,"hidden":false,"merged":[]}

{"sheet":"19","index":23,"n_rows":0,"n_cols":0,"rows_kept":0,"cut":false,"hidden":false,"merged":[]}

{"sheet":"20","index":24,"n_rows":0,"n_cols":0,"rows_kept":0,"cut":false,"hidden":false,"merged":[]}

{"sheet":"21","index":25,"n_rows":0,"n_cols":0,"rows_kept":0,"cut":false,"hidden":false,"merged":[]}

{"sheet":"22","index":26,"n_rows":0,"n_cols":0,"rows_kept":0,"cut":false,"hidden":false,"merged":[]}

{"sheet":"23","index":27,"n_rows":0,"n_cols":0,"rows_kept":0,"cut":false,"hidden":false,"merged":[]}

{"sheet":"24","index":28,"n_rows":0,"n_cols":0,"rows_kept":0,"cut":false,"hidden":false,"merged":[]}